{"text_format":"1","workbook":"xlsx","n_sheets":6,"sheets":["Welcome","Scratch","Macros Required","Input","Total Cost Chart","Instructions"],"not_rendered":{"charts":2,"images":2,"macros":1,"external_links":0,"defined_names":98,"comments":1,"pivot_tables":0},"unopened":[{"sheet":"Total Cost Chart","index":4,"reason":"not_a_worksheet"}],"bounds":{"document_bytes":16777216,"sheet_cells":100000,"rows_first":2000,"rows_last":500,"rows_between":2000,"halvings":0,"cell_chars":16384,"cell_head_chars":4096},"cells_cut":0,"cells_raw":0,"read":"whole","date_system":"1900"}

{"sheet":"Welcome","index":0,"n_rows":22,"n_cols":3,"rows_kept":22,"cut":false,"hidden":false,"merged":[[0,1,0,2],[1,1,1,2],[5,1,5,2],[7,1,7,2],[12,1,12,2],[8,1,8,2],[10,1,10,2],[11,1,11,2],[22,1,22,2],[2,1,2,2],[3,1,3,2],[4,1,4,2],[6,1,6,2],[21,1,21,2],[13,1,13,2],[20,1,20,2],[9,1,9,2],[14,1,15,2]]}
[null,"Queuing Model"]
[]
[null,"Build: 20211117 by bizpep.com"]
[]
[null,"The Queuing Model will calculate the optimum number of customer service points (staff) to minimize costs for your business. It considers the average arrival rate of customers, the average customer service rate, the cost to the business of customer waiting time (customer dissatisfaction), and the cost to operate customer service points. Queuing models are used extensively in call centers, toll booth operations and situations where a there is a queue for service including, counter staff, service staff, call response staff or maintenance staff. They can be applied in any business providing a customer service function. The model will calculate the optimum number of service points and allow you to test alternatives by manually inputting service point numbers. Additional results include the average number of customers waiting in the queue, their average waiting time, and service point (staff) utilization. The Total Cost Chart plots total cost verses number of service points to display the impact of changes in service point numbers."]
[]
[null,"To start use the sheet tabs to select the Input sheet."]
[null,"Input is in the blue cells. Non-input cells are protected to maintain formula integrity."]
[null,"Instructions…"]
[]
[null,{"$f":"IF(Scratch!B55=TRUE,\"Current license subscriptions can be managed directly from your PayPal account.\",\"In evaluation mode functionality is restriced.\")","v":"In evaluation mode functionality is restriced."}]
[null,{"$f":"IF(Scratch!B55=TRUE,\"On renewal new License Details will be emailed. You can purchase at new license at:\",\"To fully enable this application please purchase a license at:\")","v":"To fully enable this application please purchase a license at:"}]
[null,"https://bizpep.com/queuingmodel.html?display=license"]
[null,{"$f":"IF(Scratch!B55=TRUE,\"Current license details fully enable your application\",\"License Details are sent by email, on reciept input license details to fully enable your application.\")","v":"License Details are sent by email, on reciept input license details to fully enable your application."}]
[]
[]
[null,"Application License Details:"]
[null,"Licensed Email Address:"]
[null,"License Code:"]
[null,"License Valid to Date:",{"$f":"IF(Scratch!B55=TRUE,Scratch!C55,\"Not Licensed, for Evaluation Only.\")","v":"Not Licensed, for Evaluation Only."}]
[]
[null,"Suitability must be independently assessed and use indicates acceptance of any and all associated risk."]

{"sheet":"Scratch","index":1,"n_rows":107,"n_cols":10,"rows_kept":107,"cut":false,"hidden":true,"merged":[]}
[]
[]
[]
[]
[]
[]
[]
[]
[]
[]
[]
[]
[]
[]
[]
[]
[]
[]
[]
[]
[]
[]
[]
[]
[]
[]
[]
[]
[]
[]
[]
[]
[]
[]
[]
[]
[]
[]
[]
[]
[null,null,null,null,{"$f":"SUM(E42:E46)","v":331}]
[null,{"$f":"1","v":1},"q",{"$f":"IFERROR(CODE(C42),0)","v":113},{"$f":"B42*D42","v":113}]
[null,{"$f":"B42+1","v":2},"m",{"$f":"IFERROR(CODE(C43),0)","v":109},{"$f":"B43*D43","v":218}]
[null,3,null,0,0]
[null,4,null,0,0]
[null,5,null,0,0]
[]
[]
[]
[null,{"$f":"IF(Scratch!B55=TRUE,\"Licensed to \"&Welcome!C11, Welcome!C13&\" In evaluation mode functionality is limited.\")","v":" In evaluation mode functionality is limited."}]
[]
[null,"Locked",500000]
[null,{"$f":"IFERROR(AND(ISTEXT(Welcome!C18),LEN(Welcome!C18)>6),FALSE)","v":false},null,"emall len >6"]
[null,{"$f":"IFERROR(AND(ISNUMBER(INT(Welcome!C19)),LEN(Welcome!C19)>8),FALSE)","v":false},{"$f":"IFERROR(Welcome!C19/Scratch!E57/E41,FALSE)","v":false},"code len>8","yyyymmdd=code/emailchsum/i"]
[null,{"$f":"IFERROR(AND(ISNUMBER(C54),LEN(C54)=8,TODAY()<C55+7),FALSE)","v":false},{"$f":"IFERROR(DATE(MID(C54,1,4),MID(C54,5,2),MID(C54,7,2)),FALSE)","v":false},null,"yyyymmdd len=8",null,"IF(ISNUMBER(C55),IF(C55>TODAY()+3650,2,IF(C55>TODAY()-2,1,0)),0)"]
[null,null,{"$f":"IF(ISNUMBER(C55),IF(C55>TODAY()+3650,2,IF(C55>TODAY()-2,1,0)),0)","v":0},"status",">today+36500days=2",null,null,null,null,{"$f":"I56*J57*E41","v":0}]
[null,null,null,null,{"$f":"SUM(E58:E107)","v":0},null,null,null,null,{"$f":"SUM(J58:J107)","v":0}]
[null,{"$f":"1","v":1},{"$f":"MID(Welcome!$C$18,B58,1)","v":""},{"$f":"IFERROR(CODE(C58),0)","v":0},{"$f":"B58*D58","v":0},null,{"$f":"1","v":1},{"$f":"MID($G$56,G58,1)","v":""},{"$f":"IFERROR(CODE(H58),0)","v":0},{"$f":"G58*I58","v":0}]
[null,{"$f":"B58+1","v":2},{"$f":"MID(Welcome!$C$18,B59,1)","v":""},0,0,null,{"$f":"G58+1","v":2},{"$f":"MID($G$56,G59,1)","v":""},0,0]
[null,3,{"$f":"MID(Welcome!$C$18,B60,1)","v":""},0,0,null,3,"",0,0]
{"$rows_left_out":48}
{"sheet":"Macros Required","index":2,"n_rows":7,"n_cols":2,"rows_kept":7,"cut":false,"hidden":false,"merged":[]}
[null,{"$f":"\"Macros Required - \" &title","v":"Macros Required - Queuing Model"}]
[]
[null," Macros must be enabled for this application to function."]
[]
[null,"Please refer to your spreadsheet Help for details on how to enable macros."]
[]
[null,"Suitability must be independently assessed and use indicates acceptance of any and all associated risk."]

{"sheet":"Input","index":3,"n_rows":108,"n_cols":20,"rows_kept":108,"cut":false,"hidden":false,"merged":[[35,1,35,9],[29,1,29,9],[30,1,30,9],[31,1,31,9],[32,1,32,9],[33,1,33,9],[34,1,34,9],[28,1,28,9],[20,1,20,3],[20,6,20,9],[21,1,21,3],[21,6,21,9],[22,1,22,3],[22,6,22,9],[23,1,23,3],[23,6,23,9],[25,1,26,3],[25,5,26,5],[27,1,27,9],[17,1,17,3],[17,6,17,9],[18,1,18,2],[18,6,18,9],[19,1,19,3],[19,6,19,9],[14,1,14,3],[14,6,14,9],[15,1,15,3],[15,6,15,9],[16,1,16,3],[16,6,16,9],[11,1,11,3],[11,6,11,9],[12,1,12,3],[12,6,12,9],[13,1,13,3],[13,6,13,9],[8,1,8,3],[8,6,8,9],[9,1,9,3],[9,6,9,9],[10,1,10,3],[10,6,10,9],[7,1,7,3],[7,6,7,9],[1,4,1,9],[2,4,2,9],[4,1,4,9],[5,1,5,9],[6,1,6,9]]}
[]
[]
[]
[]
[null,{"$f":"\"Input - \"&title","v":"Input - Queuing Model"}]
[null," Blue cells are for input. The yellow cell is the calculated result but can accept manual inputs to test scenarios. View comments by positioning your mouse over the red marker cells or select the",null,null,null,null,null,null,null,null,null,null,null,null,null,null,null,null,{"$f":"MIN(S8:S107)","v":16},"Min"]
[null,"Instruction Sheet",null,null,null,null,null,null,null,null,null,null,null,null,null,null,5782.92,null,{"$f":"MAX(S8:S107)","v":31},"Max"]
[null,"Number of Service Points",null,null,11,{"$f":"+E8+0.000001","v":11.000000999999999},null,null,null,null,null,null,0,{"$f":"IF($E$8-1>=M8,((1/FACT(M8))*+POWER($E$9/$E$10,M8)),0)","v":1},null,0,0,{"$f":"IF(Q8=0,0,IF(Q8>2*Q$7,0,Q8))","v":0},{"$f":"IF(R8>0,ROW(R8),\"\")","v":""}]
[null,"Average Customer Arrival Rate",null,null,50,"per Hour","Average number of customers arriving/time selected.",null,null,null,null,null,1,5,null,1,0,{"$f":"IF(Q9=0,0,IF(Q9>2*Q$7,0,Q9))","v":0},{"$f":"IF(R9>0,ROW(R9),\"\")","v":""}]
[null,"Service Rate Capacity per Service Pt",null,null,10,{"$f":"+F9","v":"per Hour"},"Average number of customers that can be served/time.",null,null,null,null,null,2,12.5,null,2,0,0,""]
[null,"Probability of No Customers",null,null,{"$f":"1/(SUM($N$8:$N$107)+(1/FACT($F$8)*POWER($E$9/$E$10,$E$8))*(1/(1-($E$9/($F$8*$E$10)))))","v":6.7284236722349976E-3},null,"Likelihood of no customers waiting or being served.",null,null,null,0,null,3,20.833333333333332,null,3,0,0,""]
[null,"Average Number of Customers",null,null,{"$f":"+$E$14+$E$9/$E$10","v":5.0125744327543167},null,"Average number of customers waiting or being served.",null,null,null,null,null,4,26.041666666666664,null,4,0,0,""]
[null,"Average Time spent by Customer",null,null,{"$f":"+$E$15+1/$E$10","v":0.10025148865508633},{"$f":"+IF($F$9=$F$42,$G$42,IF($F$9=$F$43,$G$43,IF($F$9=$F$44,$G$44,IF($F$9=$F$45,$G$45,IF($F$9=$F$46,$G$46,IF($F$9=$F$47,$G$47,\"\"))))))","v":"Hours"},"Average customer time spent waiting and being served.",null,null,null,null,null,5,26.041666666666668,null,5,112500104567.60001,0,""]
[null,"Average Number Waiting",null,null,{"$f":"+$E$11*(POWER($E$9/$E$10,$F$8+1)/((FACT($F$8-1))*POWER($F$8-$E$9/$E$10,2)))","v":1.2574432754316467E-2},null,"Average number of customers waiting to be served.",null,null,null,null,null,6,21.701388888888889,null,6,69095.61,0,""]
[null,"Average Waiting Time per Customer",null,null,{"$f":"+$E$14/$E$9","v":2.5148865508632933E-4},{"$f":"+IF($F$9=$F$42,$G$42,IF($F$9=$F$43,$G$43,IF($F$9=$F$44,$G$44,IF($F$9=$F$45,$G$45,IF($F$9=$F$46,$G$46,IF($F$9=$F$47,$G$47,\"\"))))))","v":"Hours"},"Average time a customers waits for service. ",null,null,null,null,null,7,15.500992063492063,null,7,21733.45,0,""]
[null,"Utilization of Service Points",null,null,{"$f":"+$E$9/($E$10*$F$8)","v":0.45454541322314429},null,"Percentage of time that service points actually serve.",null,null,null,null,null,8,9.6881200396825395,null,8,10272.5,10272.5,16]
[null,"Time Period for Consideration",null,null,50,{"$f":"+IF($F$9=$F$42,$G$42,IF($F$9=$F$43,$G$43,IF($F$9=$F$44,$G$44,IF($F$9=$F$45,$G$45,IF($F$9=$F$46,$G$46,IF($F$9=$F$47,$G$47,\"\"))))))","v":"Hours"},"Time period for calculations.",null,null,null,null,null,9,5.3822889109347445,null,9,6764.36,6764.36,17]
[null,"Number of Customers for Time Period",null,null,{"$f":"$E$9*$E$17","v":2500},{"$f":"\"in \"&+$E$17&\" \"&$F$13","v":"in 50 Hours"},"Total number of customers over time period. ",null,null,null,null,null,10,2.6911444554673718,null,10,5812.37,5812.37,18]
[null,"Total Waiting Time",null,{"$f":"\"(\"&$F$13&\")\"","v":"(Hours)"},{"$f":"+$E$18*$E$15","v":0.62872163771582334},{"$f":"+F18","v":"in 50 Hours"},"Total waiting time over period.",null,null,null,null,null,11,0,null,11,5782.92,5782.92,19]
[null,"Cost of Waiting",null,null,450,{"$f":"+F9","v":"per Hour"},"Estimated cost to business of making customers wait.",null,null,null,null,null,12,0,null,12,6094.58,6094.58,20]
[null,"Total Cost Of Waiting",null,null,{"$f":"+$E$20*$E$19","v":282.92473697212051},{"$f":"+F18","v":"in 50 Hours"},"Calculated cost of waiting for the Time period.",null,null,null,null,null,13,0,null,13,6530.18,6530.18,21]
[null,"Cost for each Service Point",null,null,10,{"$f":"+F9","v":"per Hour"},"Cost to operate one service point per min/hour/day. ",null,null,null,null,null,14,0,null,14,7009.17,7009.17,22]
[null,"Total Cost of Service Points",null,null,{"$f":"+$E$8*$E$22*E17","v":5500},{"$f":"+F18","v":"in 50 Hours"},"Total cost of service points over period.",null,null,null,null,null,15,0,null,15,7502.65,7502.65,23]
[null,"Total Cost Waiting & Service",null,null,{"$f":"+$E$21+$E$23","v":5782.9247369721206},{"$f":"+F18","v":"in 50 Hours"},"Sum of service & waiting costs. To be minimized.",null,null,null,null,null,16,0,null,16,8000.73,8000.73,24]
[null,null,null,null,null,null,null,null,null,null,null,null,17,0,null,17,8500.19,8500.19,25]
[null,null,null,null,null,null,null,null,null,null,null,null,18,0,null,18,9000.0499999999993,9000.0499999999993,26]
[null,null,null,null,null,null,null,null,null,null,null,null,19,0,null,19,9500.01,9500.01,27]
[null,null,null,null,null,null,null,null,null,null,null,null,21,0,null,21,10000,10000,28]
[null,null,null,null,null,null,null,null,null,null,null,null,22,0,null,22,10500,10500,29]
[null,null,null,null,null,null,null,null,null,null,null,null,23,0,null,23,11000,11000,30]
[null,null,null,null,null,null,null,null,null,null,null,null,24,0,null,24,11500,11500,31]
[null,null,null,null,null,null,null,null,null,null,null,null,25,0,null,25,12000,0,""]
[null,null,null,null,null,null,null,null,null,null,null,null,26,0,null,26,12500,0,""]
[null,null,null,null,null,null,null,null,null,null,null,null,27,0,null,27,13000,0,""]
[null,null,null,null,null,null,null,null,null,null,null,null,28,0,null,28,13500,0,""]
[null,null,null,null,null,null,null,null,null,null,null,null,29,0,null,29,14000,0,""]
[null,null,null,null,null,null,null,null,null,null,null,null,30,0,null,30,14500,0,""]
[null,null,null,null,null,null,null,null,null,null,null,null,31,0,null,31,15000,0,""]
[null,null,null,null,null,null,null,null,null,null,null,null,32,0,null,32,15500,0,""]
[null,null,null,null,null,null,null,null,null,null,null,null,33,0,null,33,16000,0,""]
[null,null,null,null,null,null,null,null,null,null,null,null,34,0,null,34,16500,0,""]
[null,null,null,null,null,null,null,null,null,null,null,null,35,0,null,35,17000,0,""]
[null,null,null,null,24,"per Hour","Hours",{"$f":"+IF($C$48<$D$48,IF($C$48<=$G43,IF($D$48>$G43,$E43,1),1),IF($D$48<=$G43,IF($C$48>$G43,1/$E43,1),1))","v":1},null,null,null,null,36,0,null,36,17500,0,""]
[null,null,null,null,7,"per Day","Days",1,null,null,null,null,37,0,null,37,18000,0,""]
[null,null,null,null,{"$f":"52/12","v":4.333333333333333},"per Week","Weeks",1,null,null,null,null,38,0,null,38,18500,0,""]
[null,null,null,null,12,"per Month","Months",1,null,null,null,null,39,0,null,39,19000,0,""]
[null,null,null,null,0,"per Year","Years",1,null,null,null,null,40,0,null,40,19500,0,""]
[null,null,{"$f":"IF($F$9=$F$42,1,IF($F$9=$F$43,2,IF($F$9=$F$44,3,IF($F$9=$F$45,4,IF($F$9=$F$46,5,IF($F$9=$F$47,6,\"\"))))))","v":2},{"$f":"IF($F$17=$F$42,1,IF($F$17=$F$43,2,IF($F$17=$F$44,3,IF($F$17=$F$45,4,IF($F$17=$F$46,5,IF($F$17=$F$47,6,\"\"))))))","v":""},null,null,null,{"$f":"+H42*H43*H44*H45*H46*H47","v":0},null,null,null,null,41,0,null,41,20000,0,""]
[null,null,null,null,null,null,null,{"$f":"1/H48","v":{"$error":"#DIV/0!"}},null,null,null,null,42,0,null,42,20500,0,""]
[null,null,null,null,null,null,null,null,null,null,null,null,43,0,null,43,21000,0,""]
[null,null,null,null,null,null,null,null,null,null,null,null,44,0,null,44,21500,0,""]
[null,null,null,null,null,null,null,null,null,null,null,null,45,0,null,45,22000,0,""]
[null,null,null,null,null,null,null,null,null,null,null,null,46,0,null,46,22500,0,""]
[null,null,null,null,null,null,null,null,null,null,null,null,47,0,null,47,23000,0,""]
[null,null,null,null,null,null,null,null,null,null,null,null,48,0,null,48,23500,0,""]
[null,null,null,null,null,null,null,null,null,null,null,null,49,0,null,49,24000,0,""]
[null,null,null,null,null,null,null,null,null,null,null,null,50,0,null,50,24500,0,""]
[null,null,null,null,null,null,null,null,null,null,null,null,51,0,null,51,25000,0,""]
[null,null,null,null,null,null,null,null,null,null,null,null,52,0,null,52,25500,0,""]
[null,null,null,null,null,null,null,null,null,null,null,null,53,0,null,53,26000,0,""]
{"$rows_left_out":49}
{"sheet":"Instructions","index":5,"n_rows":26,"n_cols":4,"rows_kept":26,"cut":false,"hidden":false,"merged":[[5,1,5,3],[2,1,2,3],[6,1,6,3],[31,1,31,3],[0,1,0,3],[1,1,1,3],[32,1,32,3],[33,1,33,3],[34,1,34,3],[26,1,26,3],[28,1,28,3],[29,1,29,3],[30,1,30,3],[27,1,27,3]]}
[null,{"$f":"\"Instructions - \"& title","v":"Instructions - Queuing Model"}]
[]
[null,"Overview"]
[null,"Outline",null,"The Queuing Model will calculate the optimum number of customer service points (staff) to minimize costs for your business. It considers the average arrival rate of customers, the average customer service rate, the cost to the business of customer waiting time (customer dissatisfaction), and the cost to operate customer service points. Queuing models are used extensively in call centers, toll booth operations and situations where a there is a queue for service including, counter staff, service staff, call response staff or maintenance staff. They can be applied in any business providing a customer service function. The model will calculate the optimum number of service points and allow you to test alternatives by manually inputting service point numbers. Additional results include the average number of customers waiting in the queue, their average waiting time, and service point (staff) utilization. The Total Cost Chart plots total cost verses number of service points to display the impact of changes in service point numbers."]
[]
[null,"Input"]
[null,"All input is on the Input Sheet. Blue cells are for input. The yellow cell provides the calculated result but can accept manual input to test alternatives. To use the model simply input the required details in the blue cells and then click the Calculate Now button and the optimum Number of Service Points will be displayed in the yellow cell. The Total Cost Chart plots Total Cost verses Number of Service Points."]
[null,{"$f":"+Input!B8","v":"Number of Service Points"},null,"When you click Calculate Now this value will be set to minimize the Total Cost of Waiting and Service. The Total Cost Chart provides a graphical display of the result. You can also manually input a positive whole number up to 100 to test alternatives. The Total Cost Chart is not updated for manual inputs. The model assumes customers form a single queue and are served by a number of service points. The value indicates the number of service points. The maximum number of service points handled is 100. The model applies the M/M/s queuing structure by assuming an exponential distribution for both arrival and service. This is suitable for most general applications."]
[null,{"$f":"+Input!$B$9","v":"Average Customer Arrival Rate"},null,"Input the Average Customer Arrival Rate at your service area. For example if over an hour 50 customers arrive and require service the input is 50. You can determine this by observing actual customer arrivals over the chosen period of time. Select the time period for your arrival rate measurement from the drop down list. In our example the arrival rate was 50 per hour so we select per Hour."]
[null,{"$f":"+Input!$B$10","v":"Service Rate Capacity per Service Pt"},null,"Input the average number of customers that a service point can process for the time selected. Because this model can only handle a maximum of 100 service points the Service Rate Capacity multiplied by 100 must be greater than the Average Customer Arrival Rate for a solution to be found. On average each of our counter staff can serve 10 customers an hour so we input 10."]
[null,{"$f":"+Input!$B$11","v":"Probability of No Customers"},null,"This is the probability that there will be no customers waiting or currently being served."]
[null,{"$f":"+Input!$B$12","v":"Average Number of Customers"},null,"This is the Average Number of Customers waiting or being served."]
[null,{"$f":"+Input!$B$13","v":"Average Time spent by Customer"},null,"This is the Average Time a customer spends both waiting and being served. It is displayed as a decimal value i.e. 0.10 Hours is 6 minutes."]
[null,{"$f":"+Input!$B$14","v":"Average Number Waiting"},null,"This is the Average Number of Customers Waiting for service."]
[null,{"$f":"+Input!$B$15","v":"Average Waiting Time per Customer"},null,"This is the Average time each customer waits.  It is displayed as a decimal value."]
[null,{"$f":"+Input!$B$16","v":"Utilization of Service Points"},null,"This is the average percentage of time that service points are actually serving. A Utilization of 45% indicates that 55% of the time service points have no customers to serve."]
[null,{"$f":"+Input!$B$17","v":"Time Period for Consideration"},null,"Input a value for the number of Time Periods for Total Cost calculations. To review a week (50 hours of trading) we input 50."]
[null,{"$f":"+Input!$B$18","v":"Number of Customers for Time Period"},null,"This is the total Number of Customers arriving for service over the Time Period. It is Average Arrival Rate x Time Period for Consideration."]
[null,{"$f":"+Input!$B$19","v":"Total Waiting Time"},null,"This is the Total Waiting Time of all customers over the Time Period. It is the Number of Customers for Time Period x Average Waiting Time per Customer.  It is in decimal format. For our example the Total Waiting Time over the 50 hour period being considered in our example is 0.63 hours (37.8 minutes). If the Average Waiting Time is less than two decimal places it will display as 0 but  when multiplied by the Number of Customers for Time Period may produce a significant Total Waiting Time."]
[null,{"$f":"+Input!$B$20","v":"Cost of Waiting"},null,"Input the estimated average customer waiting cost. This is the average profit contribution lost due to customer dissatisfaction. To do this consider the percentage of customers that would not return if they had to wait a defined time, say 0.1 hour (6 minutes). Then estimate the value of purchases that they would have made over the period under consideration (in our case 50 hours).  For example if 50% of customers would not return after waiting 0.1 hours and they would have spent $150 over the period the value of lost sales is 50% x $150 / 0.1 hours or $750/hour.  This indicates that on average for every hour of customer waiting time we lose $750 in future sales for the period. To determine the actual profit contribution component of these sales we deduct our purchase cost. The average purchase cost of our goods is 40% of our sale price. Therefore the profit contribution is 60% of our sales value or $450 (60% x $750). We input $450."]
[null,{"$f":"+Input!$B$21","v":"Total Cost Of Waiting"},null,"This is the Total Cost of Customer Waiting for the Time Period. It is the Cost of Waiting x the Total Waiting Time."]
[null,{"$f":"+Input!B22","v":"Cost for each Service Point"},null,"Input the Cost to run each Service Point. In most cases this will be staffing costs. Lets say $10 per hour."]
[null,{"$f":"+Input!$B$23","v":"Total Cost of Service Points"},null,"This is the Total Cost of operating the service points over the period under consideration. It is the Number of Service Points x Time Period for Consideration x Cost for each Service Point."]
[null,{"$f":"+Input!$B$24","v":"Total Cost Waiting & Service"},null,"This is the Total Cost of Waiting and Service. This value is minimized when you Calculate Now by adjusting the Number of Service Points. It is the sum of Total Cost of Waiting and Total Cost of Service Points."]
[null,"Calculate Now",null,"Click Calculate Now after you have supplied input for the blue cells and the Number of Service Points to minimize the Total Cost of Waiting and Service will be calculated. This result is displayed in the yellow cell and in the Total Cost Chart. You can also test alternatives by manually inputting service point numbers into the yellow cell."]
[null,"Reset",null,"This will reset you model to initial default values and run Calculate Now to reset the Total Cost Chart. All user input will be deleted."]