{"text_format":"1","workbook":"xlsx","n_sheets":14,"sheets":["Macros Required","Welcome","Input Overall Performance Data","Input Customer Segment Data","Input Product Group Data","Customer Segment Results","Customer Segment Chart","Product Group Results","Product Group Chart","Combined Assessment Chart","Breakeven Chart","Instructions","Worksheet","Scratch"],"not_rendered":{"charts":8,"images":20,"macros":1,"external_links":1,"defined_names":30,"comments":3,"pivot_tables":0},"unopened":[{"sheet":"Customer Segment Chart","index":6,"reason":"not_a_worksheet"},{"sheet":"Product Group Chart","index":8,"reason":"not_a_worksheet"},{"sheet":"Combined Assessment Chart","index":9,"reason":"not_a_worksheet"},{"sheet":"Breakeven Chart","index":10,"reason":"not_a_worksheet"}],"bounds":{"document_bytes":16777216,"sheet_cells":100000,"rows_first":2000,"rows_last":500,"rows_between":2000,"halvings":0,"cell_chars":16384,"cell_head_chars":4096},"cells_cut":0,"cells_raw":0,"read":"whole","date_system":"1900"}

{"sheet":"Macros Required","index":0,"n_rows":7,"n_cols":2,"rows_kept":7,"cut":false,"hidden":false,"merged":[]}
[null,"Macros Required - Profit Contribution"]
[]
[null," Macros must be enabled for this application to function."]
[]
[null,"Please refer to your spreadsheet Help for details on how to enable macros."]
[]
[null,"Suitability must be independently assessed and use indicates acceptance of any and all associated risk."]

{"sheet":"Welcome","index":1,"n_rows":107,"n_cols":3,"rows_kept":107,"cut":false,"hidden":false,"merged":[[5,1,5,2],[0,1,0,2],[1,1,1,2],[2,1,2,2],[3,1,3,2],[4,1,4,2],[22,1,22,2],[6,1,6,2],[7,1,7,2],[8,1,8,2],[9,1,9,2],[10,1,10,2],[11,1,11,2],[12,1,12,2],[13,1,13,2],[14,1,15,2],[20,1,20,2],[21,1,21,2]]}
[null,"Profit Contribution"]
[]
[null,"Build: 20211120 by bizpep.com"]
[]
[null,"Profit Contribution breakdown allows you to identify the level of surplus/profit generated by components of your business. Default breakdown is five Customer Segments and five Product Groups. Overall variable and fixed expenses are allocated to components by applying relative indicators. This effectively allocates expenses to component areas based on the amount of expense (resource) they demand. Indicators for future potential and business ability are combined with component performance data to identify areas offering the greatest opportunity for development. Summary recommendations are provided for each breakdown and results presented in graphical and tabular form. This business tool can analyze any chosen component of an overall business or product line."]
[]
[null,"To start use the sheet tabs to select an Input sheet."]
[null,"Input is in the blue cells. Non-input cells are protected to maintain formula integrity."]
[null,"Instructions…"]
[]
[null,{"$f":"IF(Scratch!B55=TRUE,\"Current license subscriptions can be managed directly from your PayPal account.\",\"In evaluation mode functionality is restriced.\")","v":"In evaluation mode functionality is restriced."}]
[null,{"$f":"IF(Scratch!B55=TRUE,\"On renewal new License Details will be emailed. You can purchase at new license at:\",\"To fully enable this application please purchase a license at:\")","v":"To fully enable this application please purchase a license at:"}]
[null,"https://bizpep.com/profitcontribution.html?display=license"]
[null,{"$f":"IF(Scratch!B55=TRUE,\"Current license details fully enable your application\",\"License Details are sent by email, on reciept input license details to fully enable your application.\")","v":"License Details are sent by email, on reciept input license details to fully enable your application."}]
[]
{"$rows_left_out":93}
{"sheet":"Input Overall Performance Data","index":2,"n_rows":52,"n_cols":7,"rows_kept":52,"cut":false,"hidden":false,"merged":[[23,1,23,2],[24,1,24,2],[25,1,25,2],[31,1,31,2],[18,5,18,8],[19,5,19,8],[20,5,20,8],[19,1,19,2],[20,1,20,2],[21,1,21,2],[22,1,22,2],[21,5,21,8],[22,5,22,8],[23,5,23,8],[24,5,24,8],[25,5,25,8],[12,1,12,2],[17,5,17,8],[17,1,17,2],[18,1,18,2],[13,1,13,2],[13,4,13,8],[15,5,15,8],[16,5,16,8],[16,1,16,2],[15,1,15,2],[1,4,1,8],[2,4,2,8],[4,1,4,8],[10,3,10,5],[5,1,5,8],[6,1,6,8],[8,4,8,8],[10,6,10,8],[8,1,8,3],[45,1,45,8],[46,1,46,8],[47,1,47,8],[48,1,48,8],[28,5,28,8],[44,1,44,8],[32,1,32,2],[29,1,29,2],[30,1,30,2],[28,1,28,2],[38,3,38,8],[26,5,26,8],[27,5,27,8],[41,1,41,8],[42,1,42,8],[43,1,43,8],[40,1,40,8],[29,5,29,8],[30,5,30,8],[31,5,31,8],[32,5,32,8],[26,1,26,2],[27,1,27,2],[34,1,34,8],[36,1,36,2],[38,1,38,2],[36,3,36,8]]}
[]
[]
[]
[]
[null,{"$f":"\"Input Performance Data - \"&title","v":"Input Performance Data - Profit Contribution"}]
[null,"Blue cells require input. View comments by positioning your mouse over the red marker cell or click the hyperlink for the"]
[null,"Instruction Sheet"]
[]
[null,"Overall Performance Data",null,null,"This section reviews overall performance for a full year."]
[]
[null,"Business Name or Identifier",null,"Acme Widgets",null,null,"This appears on the Output Sheets."]
[]
[null,"Revenue"]
[null,"Revenue",null,500000,"Input your annual overall revenue."]
[]
{"$rows_left_out":38}
{"sheet":"Input Customer Segment Data","index":3,"n_rows":94,"n_cols":9,"rows_kept":94,"cut":false,"hidden":false,"merged":[[78,1,78,8],[68,1,68,8],[53,5,53,7],[54,1,54,8],[66,1,66,8],[64,3,64,4],[64,5,64,6],[76,1,76,2],[74,3,74,8],[72,3,72,8],[70,3,70,8],[74,1,74,2],[70,1,70,2],[72,1,72,2],[61,5,61,7],[62,1,62,8],[83,1,83,8],[84,1,84,8],[85,1,85,8],[86,1,86,8],[79,1,79,8],[80,1,80,8],[81,1,81,8],[82,1,82,8],[1,4,1,8],[2,4,2,8],[4,1,4,8],[34,1,34,2],[5,1,5,8],[6,1,6,8],[18,1,18,2],[19,1,19,2],[8,7,9,7],[32,1,32,2],[7,1,7,2],[20,1,20,2],[26,1,26,2],[22,1,22,2],[23,1,23,2],[24,1,24,2],[25,1,25,2],[50,1,50,8],[17,1,17,2],[21,1,21,2],[8,8,9,8],[16,1,16,2],[8,3,9,3],[8,4,9,4],[8,5,9,5],[8,6,9,6],[15,1,15,2],[8,1,9,2],[30,1,30,2],[31,1,31,2],[27,1,27,2],[28,1,28,2],[29,1,29,2],[56,5,56,6],[57,5,57,7],[58,1,58,8],[65,5,65,7],[33,1,33,2],[35,1,35,2],[52,3,52,4],[52,5,52,6],[46,1,46,8],[49,5,49,7],[56,3,56,4],[44,1,44,2],[42,1,42,2],[43,1,43,2],[60,3,60,4],[60,5,60,6],[48,5,48,6],[38,1,38,2],[39,1,39,2],[37,1,37,2],[41,1,41,2],[48,3,48,4]]}
[]
[]
[]
[]
[null,{"$f":"\"Input Customer Segment Data - \"&title","v":"Input Customer Segment Data - Profit Contribution"}]
[null,"Blue cells require input. View comments by positioning your mouse over the red marker cell or click the hyperlink for the"]
[null,"Instruction Sheet"]
[]
[null,"Customer Segments",null,"Customer Segment 1","Customer Segment 2","Customer Segment 3","Customer Segment 4","Customer Segment 5","Total/ Average"]
[]
[null,{"$f":"+'Input Overall Performance Data'!B14:C14","v":"Revenue"},"Percent",30,15,25,23,{"$f":"I11-SUM(D11:G11)","v":7},{"$f":"IF($C11=$B90,100,'Input Overall Performance Data'!D14)","v":100}]
[null,null,{"$f":"IF(C11=B89,B90,B89)","v":"Monetary"},{"$f":"IF($C12=$B90,D11/$I11*100,D11/100*$I12)","v":150000},{"$f":"IF($C12=$B90,E11/$I11*100,E11/100*$I12)","v":75000},{"$f":"IF($C12=$B90,F11/$I11*100,F11/100*$I12)","v":125000},{"$f":"IF($C12=$B90,G11/$I11*100,G11/100*$I12)","v":115000},{"$f":"IF($C12=$B90,H11/$I11*100,H11/100*$I12)","v":35000},{"$f":"IF($C12=$B89,'Input Overall Performance Data'!D14,100)","v":500000}]
[null,"Transaction","Num Sales",4556,433,222,2341,678,{"$f":"IF(C13=B91,Worksheet!H53,Worksheet!H51)","v":8230}]
[null,null,{"$f":"IF(C13=B91,B92,B91)","v":"Price"},{"$f":"+Worksheet!C49/D13","v":32.92361720807726},{"$f":"+Worksheet!D49/E13","v":173.21016166281754},{"$f":"+Worksheet!E49/F13","v":563.06306306306305},{"$f":"+Worksheet!F49/G13","v":49.124305852199917},{"$f":"+Worksheet!G49/H13","v":51.622418879056049},{"$f":"+Worksheet!H49/I13","v":60.753341433778857}]
[null,"Relative Indicator reference","Monetary"]
{"$rows_left_out":80}
{"sheet":"Input Product Group Data","index":4,"n_rows":94,"n_cols":9,"rows_kept":94,"cut":false,"hidden":false,"merged":[[7,1,7,2],[34,1,34,2],[31,1,31,2],[57,5,57,7],[58,1,58,8],[53,5,53,7],[54,1,54,8],[56,3,56,4],[56,5,56,6],[24,1,24,2],[8,6,9,6],[43,1,43,2],[8,7,9,7],[8,8,9,8],[15,1,15,2],[16,1,16,2],[5,1,5,8],[6,1,6,8],[1,4,1,8],[2,4,2,8],[4,1,4,8],[84,1,84,8],[85,1,85,8],[86,1,86,8],[79,1,79,8],[80,1,80,8],[81,1,81,8],[82,1,82,8],[83,1,83,8],[78,1,78,8],[60,3,60,4],[60,5,60,6],[61,5,61,7],[66,1,66,8],[62,1,62,8],[64,3,64,4],[70,1,70,2],[68,1,68,8],[72,1,72,2],[74,1,74,2],[74,3,74,8],[76,1,76,2],[75,1,75,2],[72,3,72,8],[32,1,32,2],[25,1,25,2],[26,1,26,2],[27,1,27,2],[28,1,28,2],[29,1,29,2],[30,1,30,2],[8,5,9,5],[18,1,18,2],[19,1,19,2],[22,1,22,2],[23,1,23,2],[20,1,20,2],[21,1,21,2],[8,3,9,3],[8,4,9,4],[8,1,9,2],[17,1,17,2],[38,1,38,2],[42,1,42,2],[39,1,39,2],[41,1,41,2],[33,1,33,2],[35,1,35,2],[37,1,37,2],[44,1,44,2],[46,1,46,8],[48,3,48,4],[48,5,48,6],[49,5,49,7],[50,1,50,8],[70,3,70,8],[52,3,52,4],[52,5,52,6],[64,5,64,6],[65,5,65,7]]}
[]
[]
[]
[]
[null,{"$f":"\"Input Product Group Data - \"&title","v":"Input Product Group Data - Profit Contribution"}]
[null,"Blue cells require input. View comments by positioning your mouse over the red marker cell or click the hyperlink for the"]
[null,"Instruction Sheet"]
[]
[null,"Product Groups",null,"Product Group 1","Product Group 2","Product Group 3","Product Group 4","Product Group 5","Total/ Average"]
[]
[null,{"$f":"+'Input Overall Performance Data'!B14:C14","v":"Revenue"},"Monetary",165000,70000,120000,95000,{"$f":"I11-SUM(D11:G11)","v":50000},{"$f":"IF($C11=$B90,100,'Input Overall Performance Data'!D14)","v":500000}]
[null,null,{"$f":"IF(C11=B89,B90,B89)","v":"Percent"},{"$f":"IF($C12=$B90,D11/$I11*100,D11/100*$I12)","v":33},{"$f":"IF($C12=$B90,E11/$I11*100,E11/100*$I12)","v":14.000000000000002},{"$f":"IF($C12=$B90,F11/$I11*100,F11/100*$I12)","v":24},{"$f":"IF($C12=$B90,G11/$I11*100,G11/100*$I12)","v":19},{"$f":"IF($C12=$B90,H11/$I11*100,H11/100*$I12)","v":10},{"$f":"IF($C12=$B89,'Input Overall Performance Data'!D14,100)","v":100}]
[null,{"$f":"+'Input Customer Segment Data'!B13","v":"Transaction"},"Price",30,34,55,65,134,{"$f":"IF(C13=B91,Worksheet!H185,Worksheet!H183)","v":43.195370626978253}]
[null,null,{"$f":"IF(C13=B91,B92,B91)","v":"Num Sales"},{"$f":"+Worksheet!C181/D13","v":5500},{"$f":"+Worksheet!D181/E13","v":2058.8235294117649},{"$f":"+Worksheet!E181/F13","v":2181.818181818182},{"$f":"+Worksheet!F181/G13","v":1461.5384615384614},{"$f":"+Worksheet!G181/H13","v":373.13432835820896},{"$f":"+Worksheet!H181/I13","v":11575.314501126615}]
[null,"Relative Indicator base","Transaction"]
{"$rows_left_out":80}
{"sheet":"Customer Segment Results","index":5,"n_rows":53,"n_cols":8,"rows_kept":53,"cut":false,"hidden":false,"merged":[[62,1,62,7],[57,1,57,7],[58,1,58,7],[59,1,59,7],[60,1,60,7],[1,1,1,7],[54,1,54,7],[56,1,56,7],[61,1,61,7],[55,1,55,8]]}
[]
[null,{"$f":"\"Customer Segment Results - \"&title","v":"Customer Segment Results - Profit Contribution"}]
[null,{"$f":"+'Input Customer Segment Data'!B9","v":"Customer Segments"}]
[null,{"$f":"Worksheet!B3","v":"Acme Widgets"}]
[null,null,{"$f":"+Worksheet!C47","v":"Customer Segment 1"},{"$f":"+Worksheet!D47","v":"Customer Segment 2"},{"$f":"+Worksheet!E47","v":"Customer Segment 3"},{"$f":"+Worksheet!F47","v":"Customer Segment 4"},{"$f":"+Worksheet!G47","v":"Customer Segment 5"},{"$f":"+Worksheet!H47","v":"Total/ Average"}]
[null,{"$f":"Worksheet!B5","v":"Revenue"},{"$f":"+Worksheet!C49","v":150000},{"$f":"+Worksheet!D49","v":75000},{"$f":"+Worksheet!E49","v":125000},{"$f":"+Worksheet!F49","v":115000},{"$f":"+Worksheet!G49","v":35000},{"$f":"+Worksheet!H49","v":500000}]
[null,null,{"$f":"+Worksheet!C50","v":0.3},{"$f":"+Worksheet!D50","v":0.15},{"$f":"+Worksheet!E50","v":0.25},{"$f":"+Worksheet!F50","v":0.23},{"$f":"+Worksheet!G50","v":7.0000000000000007E-2},{"$f":"+Worksheet!H50","v":1}]
[null,{"$f":"Worksheet!B6","v":"Expenses"}]
[null,{"$f":"Worksheet!B7","v":"Variable Costs"}]
[null,{"$f":"Worksheet!B8","v":"Materials & Supplies"},{"$f":"+Worksheet!C59","v":2481.8457578821581},{"$f":"+Worksheet!D59","v":1516.6835187057634},{"$f":"+Worksheet!E59","v":2757.6063976468431},{"$f":"+Worksheet!F59","v":2600.4228329809725},{"$f":"+Worksheet!G59","v":643.44149278426346},{"$f":"+Worksheet!H59","v":10000}]
[null,{"$f":"Worksheet!B9","v":"% Revenue"},{"$f":"+Worksheet!C60","v":1.6545638385881054E-2},{"$f":"+Worksheet!D60","v":2.0222446916076844E-2},{"$f":"+Worksheet!E60","v":2.2060851181174745E-2},{"$f":"+Worksheet!F60","v":2.2612372460704109E-2},{"$f":"+Worksheet!G60","v":1.8384042650978955E-2},{"$f":"+Worksheet!H60","v":0.02}]
[null,{"$f":"Worksheet!B10","v":"Labor excluding Owner"},{"$f":"+Worksheet!C64","v":52298.975811723678},{"$f":"+Worksheet!D64","v":39224.231858792758},{"$f":"+Worksheet!E64","v":48485.508825452169},{"$f":"+Worksheet!F64","v":49618.653301372848},{"$f":"+Worksheet!G64","v":10372.630202658531},{"$f":"+Worksheet!H64","v":200000}]
[null,{"$f":"Worksheet!B11","v":"% Revenue"},{"$f":"+Worksheet!C65","v":0.34865983874482454},{"$f":"+Worksheet!D65","v":0.5229897581172368},{"$f":"+Worksheet!E65","v":0.38788407060361735},{"$f":"+Worksheet!F65","v":0.43146655044672039},{"$f":"+Worksheet!G65","v":0.29636086293310088},{"$f":"+Worksheet!H65","v":0.4}]
[null,{"$f":"Worksheet!B12","v":"Labor Owner"},{"$f":"+Worksheet!C69","v":17167.381974248929},{"$f":"+Worksheet!D69","v":7868.383404864092},{"$f":"+Worksheet!E69","v":11921.793037672867},{"$f":"+Worksheet!F69","v":9871.2446351931339},{"$f":"+Worksheet!G69","v":3171.1969480209832},{"$f":"+Worksheet!H69","v":50000.000000000007}]
[null,{"$f":"Worksheet!B13","v":"% Revenue"},{"$f":"+Worksheet!C70","v":0.11444921316165953},{"$f":"+Worksheet!D70","v":0.10491177873152123},{"$f":"+Worksheet!E70","v":9.5374344301382932E-2},{"$f":"+Worksheet!F70","v":8.5836909871244649E-2},{"$f":"+Worksheet!G70","v":9.0605627086313811E-2},{"$f":"+Worksheet!H70","v":0.10000000000000002}]
{"$rows_left_out":39}
{"sheet":"Product Group Results","index":7,"n_rows":53,"n_cols":8,"rows_kept":53,"cut":false,"hidden":false,"merged":[[62,1,62,7],[57,1,57,7],[58,1,58,7],[59,1,59,7],[60,1,60,7],[1,1,1,7],[54,1,54,7],[56,1,56,7],[61,1,61,7],[55,1,55,8]]}
[]
[null,{"$f":"\"Product Group Results - \"&title","v":"Product Group Results - Profit Contribution"}]
[null,{"$f":"+Worksheet!B179","v":"Product Groups"}]
[null,{"$f":"Worksheet!B3","v":"Acme Widgets"}]
[null,null,{"$f":"+Worksheet!C179","v":"Product Group 1"},{"$f":"+Worksheet!D179","v":"Product Group 2"},{"$f":"+Worksheet!E179","v":"Product Group 3"},{"$f":"+Worksheet!F179","v":"Product Group 4"},{"$f":"+Worksheet!G179","v":"Product Group 5"},{"$f":"+Worksheet!H179","v":"Total/ Average"}]
[null,{"$f":"Worksheet!B5","v":"Revenue"},{"$f":"+Worksheet!C181","v":165000},{"$f":"+Worksheet!D181","v":70000},{"$f":"+Worksheet!E181","v":120000},{"$f":"+Worksheet!F181","v":95000},{"$f":"+Worksheet!G181","v":50000},{"$f":"+Worksheet!H181","v":500000}]
[null,null,{"$f":"+Worksheet!C182","v":0.33},{"$f":"+Worksheet!D182","v":0.14000000000000001},{"$f":"+Worksheet!E182","v":0.24},{"$f":"+Worksheet!F182","v":0.19},{"$f":"+Worksheet!G182","v":0.1},{"$f":"+Worksheet!H182","v":1}]
[null,{"$f":"Worksheet!B6","v":"Expenses"}]
[null,{"$f":"Worksheet!B7","v":"Variable Costs"}]
[null,{"$f":"Worksheet!B8","v":"Materials & Supplies"},{"$f":"+Worksheet!C191","v":3830.7484645443278},{"$f":"+Worksheet!D191","v":2458.2343087984991},{"$f":"+Worksheet!E191","v":2387.9990428328279},{"$f":"+Worksheet!F191","v":988.87652671154262},{"$f":"+Worksheet!G191","v":334.14165711280248},{"$f":"+Worksheet!H191","v":10000}]
[null,{"$f":"Worksheet!B9","v":"% Revenue"},{"$f":"+Worksheet!C192","v":2.5538323096962186E-2},{"$f":"+Worksheet!D192","v":3.2776457450646654E-2},{"$f":"+Worksheet!E192","v":1.9103992342662624E-2},{"$f":"+Worksheet!F192","v":8.5989263192308048E-3},{"$f":"+Worksheet!G192","v":9.5469044889372138E-3},{"$f":"+Worksheet!H192","v":0.02}]
[null,{"$f":"Worksheet!B10","v":"Labor excluding Owner"},{"$f":"+Worksheet!C196","v":97582.067576458081},{"$f":"+Worksheet!D196","v":33207.315169431531},{"$f":"+Worksheet!E196","v":43285.088427603951},{"$f":"+Worksheet!F196","v":20508.983814861433},{"$f":"+Worksheet!G196","v":5416.5450116450156},{"$f":"+Worksheet!H196","v":200000}]
[null,{"$f":"Worksheet!B11","v":"% Revenue"},{"$f":"+Worksheet!C197","v":0.65054711717638725},{"$f":"+Worksheet!D197","v":0.44276420225908708},{"$f":"+Worksheet!E197","v":0.34628070742083161},{"$f":"+Worksheet!F197","v":0.17833898969444725},{"$f":"+Worksheet!G197","v":0.15475842890414329},{"$f":"+Worksheet!H197","v":0.4}]
[null,{"$f":"Worksheet!B12","v":"Labor Owner"},{"$f":"+Worksheet!C201","v":26296.041612726352},{"$f":"+Worksheet!D201","v":7291.4355828514344},{"$f":"+Worksheet!E201","v":8499.7306222953866},{"$f":"+Worksheet!F201","v":6987.7593096755327},{"$f":"+Worksheet!G201","v":925.03287245130139},{"$f":"+Worksheet!H201","v":50000}]
[null,{"$f":"Worksheet!B13","v":"% Revenue"},{"$f":"+Worksheet!C202","v":0.17530694408484235},{"$f":"+Worksheet!D202","v":9.7219141104685797E-2},{"$f":"+Worksheet!E202","v":6.7997844978363087E-2},{"$f":"+Worksheet!F202","v":6.0763124431961156E-2},{"$f":"+Worksheet!G202","v":2.6429510641465755E-2},{"$f":"+Worksheet!H202","v":0.1}]
{"$rows_left_out":39}
{"sheet":"Instructions","index":11,"n_rows":61,"n_cols":4,"rows_kept":61,"cut":false,"hidden":false,"merged":[[62,1,62,8],[1,1,1,3],[61,1,61,3],[7,1,7,3],[2,1,2,3],[8,1,8,3],[69,1,69,3],[63,1,63,3],[64,1,64,3],[65,1,65,3],[66,1,66,3],[67,1,67,3],[68,1,68,3]]}
[]
[null,{"$f":"\"Instructions - \"&title","v":"Instructions - Profit Contribution"}]
[null,"Overview"]
[null,"Outline",null,"Profit Contribution Breakdown allows you to identify the level of surplus/profit generated by components of your business. Default breakdown is five Customer Segments and five Product Groups. Overall variable and fixed expenses are allocated to components by applying relative indicators. This effectively allocates expenses to component areas based on the amount of expense (resource) they demand. Indicators for future potential and business ability are combined with component performance data to identify areas offering the greatest opportunity for development. Summary recommendations are provided for each breakdown and results presented in graphical and tabular form. This business tool can analyze any chosen component of an overall business or product line."]
[]
[]
[]
[null,"Input"]
[null,"All inputs are in Blue cells on the Input Sheets. Click the tab, hyperlinks or buttons to access."]
[null,{"$f":"+'Input Overall Performance Data'!B9","v":"Overall Performance Data"},null,"This section reviews the overall performance of your business for a full year period. You can include up to 6 categories for expenses that vary with your sales (Variable Costs) and another 6 categories for expenses that don't vary with your sales (Fixed Costs). Input your descriptions and values in the blue cells. Example categories are provided.  Your input can be based on a recent tax return or Profit and Loss statement. If you exclude asset and capital items the result will represent your day to day operating surplus/profit.  Inputs do not have to be perfect but should reasonably reflect business operation. Analysis will determine the contribution made by customer segments and product groups to overall performance. This allows you to identify the most profitable components of your business and direct resources to maximize your current and future returns. If you wish to analyze a specific area of your business i.e. a product line, use data for that specific area as input for overall performance."]
[null,{"$f":"+'Input Overall Performance Data'!B11","v":"Business Name or Identifier"},null,"Input a name for the overall business. This appears as an identifier on the Output Sheets."]
[null,{"$f":"+'Input Overall Performance Data'!B14","v":"Revenue"},null,"If desired input a descriptive name for your revenue. Input the value of overall revenue for a full year. "]
[null,"Expenses",null,"Select your Expense input as Monetary or Percent. This allows you to input your Expenses directly in Monetary (Dollars, Pounds etc) or Percentage terms."]
[null,{"$f":"+'Input Overall Performance Data'!B17","v":"Variable Costs"},null,"Variable Costs change with the volume of product or service you provide.  Only include these costs in this section. You can input a descriptive name for these costs and define up to six categories for cost allocation."]
[null,{"$f":"+'Input Overall Performance Data'!B25:C25","v":"Fixed Costs"},null,"Fixed Costs are expenses which remain constant (up to a point) while the volume of sales vary. You can input a descriptive name for these costs and define up to six categories for cost allocation."]
{"$rows_left_out":47}
{"sheet":"Worksheet","index":12,"n_rows":322,"n_cols":19,"rows_kept":322,"cut":false,"hidden":true,"merged":[[318,9,318,10],[319,9,319,10],[320,9,320,10],[321,9,321,10],[314,9,314,10],[315,9,315,10],[316,9,316,10],[317,9,317,10],[310,9,310,10],[311,9,311,10],[312,9,312,10],[313,9,313,10],[126,9,126,10],[127,9,127,10],[128,9,128,10],[129,9,129,10],[180,9,180,10],[181,9,181,10],[115,9,115,10],[108,9,108,10],[109,9,109,10],[110,9,110,10],[111,9,111,10],[122,9,122,10],[123,9,123,10],[124,9,124,10],[125,9,125,10],[118,9,118,10],[119,9,119,10],[120,9,120,10],[121,9,121,10],[106,9,106,10],[107,9,107,10],[98,9,98,10],[99,9,99,10],[100,9,100,10],[101,9,101,10],[112,9,112,10],[113,9,113,10],[114,9,114,10],[95,9,95,10],[96,9,96,10],[97,9,97,10],[90,9,90,10],[91,9,91,10],[92,9,92,10],[93,9,93,10],[104,9,104,10],[105,9,105,10],[84,9,84,10],[85,9,85,10],[86,9,86,10],[87,9,87,10],[80,9,80,10],[81,9,81,10],[82,9,82,10],[83,9,83,10],[94,9,94,10],[64,9,64,10],[65,9,65,10],[76,9,76,10],[77,9,77,10],[78,9,78,10],[79,9,79,10],[70,9,70,10],[71,9,71,10],[72,9,72,10],[73,9,73,10],[48,9,48,10],[49,9,49,10],[50,9,50,10],[51,9,51,10],[301,1,301,4],[302,1,302,4],[289,1,289,4],[290,1,290,4],[291,1,291,4],[292,1,292,4],[56,9,56,10],[57,9,57,10],[58,9,58,10],[59,9,59,10],[52,9,52,10],[53,9,53,10],[54,9,54,10],[55,9,55,10],[66,9,66,10],[67,9,67,10],[68,9,68,10],[69,9,69,10],[62,9,62,10],[63,9,63,10],[285,1,285,4],[286,1,286,4],[287,1,287,4],[288,1,288,4],[281,1,281,4],[282,1,282,4],[283,1,283,4],[284,1,284,4],[303,1,303,4],[297,1,297,4],[298,1,298,4],[299,1,299,4],[300,1,300,4],[293,1,293,4],[294,1,294,4],[295,1,295,4],[296,1,296,4],[163,1,163,4],[164,1,164,4],[277,1,277,4],[278,1,278,4],[279,1,279,4],[280,1,280,4],[169,1,169,4],[170,1,170,4],[171,1,171,4],[172,1,172,4],[45,1,45,2],[145,1,145,4],[146,1,146,4],[276,1,276,4],[147,1,147,4],[148,1,148,4],[149,1,149,4],[150,1,150,4],[151,1,151,4],[152,1,152,4],[157,1,157,4],[158,1,158,4],[159,1,159,4],[160,1,160,4],[153,1,153,4],[154,1,154,4],[155,1,155,4],[156,1,156,4],[165,1,165,4],[166,1,166,4],[167,1,167,4],[168,1,168,4],[161,1,161,4],[162,1,162,4],[188,9,188,10],[189,9,189,10],[190,9,190,10],[191,9,191,10],[194,9,194,10],[195,9,195,10],[182,9,182,10],[183,9,183,10],[184,9,184,10],[185,9,185,10],[186,9,186,10],[187,9,187,10],[202,9,202,10],[203,9,203,10],[204,9,204,10],[205,9,205,10],[208,9,208,10],[209,9,209,10],[196,9,196,10],[197,9,197,10],[198,9,198,10],[199,9,199,10],[200,9,200,10],[201,9,201,10],[216,9,216,10],[217,9,217,10],[218,9,218,10],[219,9,219,10],[222,9,222,10],[223,9,223,10],[210,9,210,10],[211,9,211,10],[212,9,212,10],[213,9,213,10],[214,9,214,10],[215,9,215,10],[230,9,230,10],[231,9,231,10],[232,9,232,10],[233,9,233,10],[236,9,236,10],[237,9,237,10],[224,9,224,10],[225,9,225,10],[226,9,226,10],[227,9,227,10],[228,9,228,10],[229,9,229,10],[244,9,244,10],[245,9,245,10],[246,9,246,10],[247,9,247,10],[250,9,250,10],[251,9,251,10],[238,9,238,10],[239,9,239,10],[240,9,240,10],[241,9,241,10],[242,9,242,10],[243,9,243,10],[258,9,258,10],[259,9,259,10],[260,9,260,10],[261,9,261,10],[252,9,252,10],[253,9,253,10],[254,9,254,10],[255,9,255,10],[256,9,256,10],[257,9,257,10]]}
[]
[null,"Current Performance"]
[null,{"$f":"+'Input Overall Performance Data'!D11","v":"Acme Widgets"}]
[null,null,"Current"]
[null,{"$f":"+'Input Overall Performance Data'!B14","v":"Revenue"},{"$f":"+'Input Overall Performance Data'!D14","v":500000}]
[null,{"$f":"+'Input Overall Performance Data'!B16","v":"Expenses"}]
[null,{"$f":"+'Input Overall Performance Data'!B17","v":"Variable Costs"}]
[null,{"$f":"+'Input Overall Performance Data'!B18","v":"Materials & Supplies"},{"$f":"IF('Input Overall Performance Data'!D$16='Input Overall Performance Data'!B$51,'Input Overall Performance Data'!D$18,'Input Overall Performance Data'!E$18)","v":10000}]
[null,"% Revenue",{"$f":"+C8/C$5","v":0.02}]
[null,{"$f":"+'Input Overall Performance Data'!B19","v":"Labor excluding Owner"},{"$f":"IF('Input Overall Performance Data'!D$16='Input Overall Performance Data'!B$51,'Input Overall Performance Data'!D$19,'Input Overall Performance Data'!E$19)","v":200000}]
[null,"% Revenue",{"$f":"+C10/C$5","v":0.4}]
[null,{"$f":"+'Input Overall Performance Data'!B20","v":"Labor Owner"},{"$f":"IF('Input Overall Performance Data'!D$16='Input Overall Performance Data'!B$51,'Input Overall Performance Data'!D$20,'Input Overall Performance Data'!E$20)","v":50000}]
[null,"% Revenue",{"$f":"+C12/C$5","v":0.1}]
[null,{"$f":"+'Input Overall Performance Data'!B21","v":"Distribution"},{"$f":"IF('Input Overall Performance Data'!D$16='Input Overall Performance Data'!B$51,'Input Overall Performance Data'!D$21,'Input Overall Performance Data'!E$21)","v":20000}]
[null,"% Revenue",{"$f":"+C14/C$5","v":0.04}]
{"$rows_left_out":308}
{"sheet":"Scratch","index":13,"n_rows":107,"n_cols":10,"rows_kept":107,"cut":false,"hidden":true,"merged":[]}
[]
[]
[]
[]
[]
[]
[]
[]
[]
[]
[]
[]
[]
[]
[]
{"$rows_left_out":92}