{"text_format":"1","workbook":"xlsx","n_sheets":18,"sheets":["Macros Required","Welcome","Input","Sensitivity Analysis","Expected Results","Optimistic Results","Pessimistic Results","Forecast Revenue Chart","Forecast Surplus Chart","Forecast Return Chart","Operating Surplus Chart","Budget by Month Master","Budget by Month Master Chart","Budget by Month","Budget by Month Chart","Instructions","Worksheet","Scratch"],"not_rendered":{"charts":12,"images":30,"macros":1,"external_links":0,"defined_names":19,"comments":4,"pivot_tables":0},"unopened":[{"sheet":"Forecast Revenue Chart","index":7,"reason":"not_a_worksheet"},{"sheet":"Forecast Surplus Chart","index":8,"reason":"not_a_worksheet"},{"sheet":"Forecast Return Chart","index":9,"reason":"not_a_worksheet"},{"sheet":"Operating Surplus Chart","index":10,"reason":"not_a_worksheet"},{"sheet":"Budget by Month Master Chart","index":12,"reason":"not_a_worksheet"},{"sheet":"Budget by Month Chart","index":14,"reason":"not_a_worksheet"}],"bounds":{"document_bytes":16777216,"sheet_cells":100000,"rows_first":2000,"rows_last":500,"rows_between":2000,"halvings":0,"cell_chars":16384,"cell_head_chars":4096},"cells_cut":0,"cells_raw":0,"read":"whole","date_system":"1900"}

{"sheet":"Macros Required","index":0,"n_rows":7,"n_cols":2,"rows_kept":7,"cut":false,"hidden":false,"merged":[]}
[null,{"$f":"\"Macros Required - \"&title","v":"Macros Required - Forecast Budget"}]
[]
[null," Macros must be enabled for this application to function."]
[]
[null,"Please refer to your spreadsheet Help for details on how to enable macros."]
[]
[null,"Suitability must be independently assessed and use indicates acceptance of any and all associated risk."]

{"sheet":"Welcome","index":1,"n_rows":107,"n_cols":3,"rows_kept":107,"cut":false,"hidden":false,"merged":[[5,1,5,2],[0,1,0,2],[1,1,1,2],[2,1,2,2],[3,1,3,2],[4,1,4,2],[22,1,22,2],[6,1,6,2],[7,1,7,2],[8,1,8,2],[9,1,9,2],[10,1,10,2],[11,1,11,2],[12,1,12,2],[13,1,13,2],[14,1,15,2],[20,1,20,2],[21,1,21,2]]}
[null,"Forecast Budget"]
[]
[null,"Build: 20220225 by bizpep.com"]
[]
[null,"Shift Scheduler will build a roster structure to your specifications, allocate staff automatically, and generate a printable roster, all at the click of a button. It is compact and user friendly allowing you to add staff and shifts (maximum 150) with ease. Default values for continuous shifts mean that the only shift data required is the start date/time and length for the first shift, everything else is automated."]
[]
[null,"To start use the sheet tabs to select the Input sheet."]
[null,"Input is in the blue cells. Non-input cells are protected to maintain formula integrity."]
[null,"help"]
[]
{"$rows_left_out":98}
{"sheet":"Input","index":2,"n_rows":82,"n_cols":6,"rows_kept":82,"cut":false,"hidden":false,"merged":[[56,2,56,5],[57,2,57,5],[58,2,58,5],[66,2,66,5],[67,2,67,5],[60,2,60,5],[61,2,61,5],[62,2,62,5],[63,2,63,5],[64,2,64,5],[65,2,65,5],[35,1,35,2],[35,3,35,5],[49,3,49,5],[50,3,50,5],[53,1,53,5],[51,3,51,5],[47,3,47,5],[1,3,1,5],[2,3,2,5],[4,1,4,5],[5,1,5,5],[23,4,23,5],[6,1,6,5],[14,4,14,5],[8,3,8,5],[11,1,11,5],[10,2,10,4],[12,3,12,5],[20,4,20,5],[21,4,21,5],[15,4,15,5],[18,4,18,5],[19,4,19,5],[69,1,69,5],[54,1,54,5],[8,1,8,2],[16,4,16,5],[17,4,17,5],[30,4,30,5],[22,4,22,5],[24,4,24,5],[25,4,25,5],[29,4,29,5],[27,4,27,5],[28,4,28,5],[26,4,26,5],[59,2,59,5],[31,4,31,5],[32,4,32,5],[75,1,75,5],[76,1,76,5],[77,1,77,5],[78,1,78,5],[70,1,70,5],[72,1,72,5],[73,1,73,5],[74,1,74,5],[71,1,71,5]]}
[]
[]
[]
[]
[null,{"$f":" \"Input - \" &title","v":"Input - Forecast Budget"}]
[null,"Blue cells require input. View comments by positioning your mouse over the red marker cell or click the hyperlink for the"]
[null,"Instruction Sheet"]
[]
[null,"Current Operating Performance Data",null,"This section reviews current business performance for a full year."]
[]
{"$rows_left_out":73}
{"sheet":"Sensitivity Analysis","index":3,"n_rows":24,"n_cols":7,"rows_kept":24,"cut":false,"hidden":false,"merged":[[1,2,1,6],[2,2,2,6],[4,1,4,6],[5,1,5,6],[24,1,24,6],[21,1,21,6],[6,5,7,6],[6,1,6,3],[7,1,7,3],[30,1,30,6],[31,1,31,6],[32,1,32,6],[33,1,33,6],[25,1,25,6],[27,1,27,6],[28,1,28,6],[29,1,29,6],[26,1,26,6]]}
[]
[]
[]
[]
[null,"Sensitivity Analysis"]
[null,"To test the sensitivity of your forecast input adjustment percentages in the blue cells. Green cells provide Optimistic results, yellow cells Expected, and tan cells Pessimistic. An Output Summary is provided at the bottom of this sheet."]
[null,"Optimistic, improve the variation of all Relative Indicators by",null,null,0.2]
[null,"Pessimistic, degrade the variation of all Relative Indicators by",null,null,0.2]
[null,null,"Current Year","Year 1","Year 2","Year 3","3 Year Average"]
[null,{"$f":"+Worksheet!B5","v":"Business Revenue"}]
{"$rows_left_out":15}
{"sheet":"Expected Results","index":4,"n_rows":51,"n_cols":7,"rows_kept":51,"cut":false,"hidden":false,"merged":[[1,1,1,6],[52,1,52,6],[53,1,53,6],[55,1,55,6],[54,1,54,6],[60,1,60,6],[61,1,61,6],[56,1,56,6],[57,1,57,6],[58,1,58,6],[59,1,59,6]]}
[]
[null,"Expected Results"]
[null,{"$f":"Worksheet!B2","v":"Expected Forecast"}]
[null,{"$f":"Worksheet!B3","v":"Acme Widgets"}]
[null,null,{"$f":"Worksheet!C4","v":"Current Year"},{"$f":"Worksheet!D4","v":"Year 1"},{"$f":"Worksheet!E4","v":"Year 2"},{"$f":"Worksheet!F4","v":"Year 3"},{"$f":"Worksheet!G4","v":"3 Year Average"}]
[null,{"$f":"Worksheet!B5","v":"Business Revenue"},{"$f":"Worksheet!C5","v":500000},{"$f":"Worksheet!D5","v":560679.61165048543},{"$f":"Worksheet!E5","v":588713.59223300975},{"$f":"Worksheet!F5","v":625128.8659793816},{"$f":"Worksheet!G5","v":591507.35662095889}]
[null,{"$f":"Worksheet!B6","v":"Expenses"}]
[null,{"$f":"Worksheet!B7","v":"Variable Costs"}]
[null,{"$f":"Worksheet!B8","v":"Materials & Supplies"},{"$f":"Worksheet!C8","v":10000},{"$f":"Worksheet!D8","v":11431.331888019608},{"$f":"Worksheet!E8","v":12002.898482420587},{"$f":"Worksheet!F8","v":12745.345811230112},{"$f":"Worksheet!G8","v":12059.858727223434}]
[null,{"$f":"Worksheet!B9","v":"% Revenue"},{"$f":"Worksheet!C9","v":0.02},{"$f":"Worksheet!D9","v":2.0388349514563111E-2},{"$f":"Worksheet!E9","v":2.0388349514563107E-2},{"$f":"Worksheet!F9","v":2.0388349514563111E-2},{"$f":"Worksheet!G9","v":2.0388349514563107E-2}]
{"$rows_left_out":42}
{"sheet":"Optimistic Results","index":5,"n_rows":51,"n_cols":7,"rows_kept":51,"cut":false,"hidden":false,"merged":[[1,1,1,6],[52,1,52,6],[53,1,53,6],[55,1,55,6],[54,1,54,6],[60,1,60,6],[61,1,61,6],[56,1,56,6],[57,1,57,6],[58,1,58,6],[59,1,59,6]]}
[]
[null,"Optimistic Results"]
[null,{"$f":"Worksheet!J2","v":"Optimistic Forecast improved by"},{"$f":"Worksheet!K2","v":0.2}]
[null,{"$f":"Worksheet!J3","v":"Acme Widgets"}]
[null,null,{"$f":"Worksheet!K4","v":"Current Year"},{"$f":"Worksheet!L4","v":"Year 1"},{"$f":"Worksheet!M4","v":"Year 2"},{"$f":"Worksheet!N4","v":"Year 3"},{"$f":"Worksheet!O4","v":"3 Year Average"}]
[null,{"$f":"Worksheet!J5","v":"Business Revenue"},{"$f":"Worksheet!K5","v":500000},{"$f":"Worksheet!L5","v":579687.5},{"$f":"Worksheet!M5","v":614468.75},{"$f":"Worksheet!N5","v":660362.68153526972},{"$f":"Worksheet!O5","v":618172.9771784232}]
[null,{"$f":"Worksheet!J6","v":"Expenses"}]
[null,{"$f":"Worksheet!J7","v":"Variable Costs"}]
[null,{"$f":"Worksheet!J8","v":"Materials & Supplies"},{"$f":"Worksheet!K8","v":10000},{"$f":"Worksheet!L8","v":11750.422297297297},{"$f":"Worksheet!M8","v":12337.943412162162},{"$f":"Worksheet!N8","v":13259.449559128632},{"$f":"Worksheet!O8","v":12449.271756196031}]
[null,{"$f":"Worksheet!J9","v":"% Revenue"},{"$f":"Worksheet!K9","v":0.02},{"$f":"Worksheet!L9","v":2.0270270270270268E-2},{"$f":"Worksheet!M9","v":2.0079041305456399E-2},{"$f":"Worksheet!N9","v":2.0079041305456402E-2},{"$f":"Worksheet!O9","v":2.013881585866022E-2}]
{"$rows_left_out":42}
{"sheet":"Pessimistic Results","index":6,"n_rows":51,"n_cols":7,"rows_kept":51,"cut":false,"hidden":false,"merged":[[1,1,1,6],[52,1,52,6],[53,1,53,6],[55,1,55,6],[54,1,54,6],[60,1,60,6],[61,1,61,6],[56,1,56,6],[57,1,57,6],[58,1,58,6],[59,1,59,6]]}
[]
[null,"Pessimistic Results"]
[null,{"$f":"Worksheet!Q2","v":"Pessimistic Forecast degraded by"},{"$f":"Worksheet!R2","v":0.2}]
[null,{"$f":"Worksheet!Q3","v":"Acme Widgets"}]
[null,null,{"$f":"Worksheet!R4","v":"Current Year"},{"$f":"Worksheet!S4","v":"Year 1"},{"$f":"Worksheet!T4","v":"Year 2"},{"$f":"Worksheet!U4","v":"Year 3"},{"$f":"Worksheet!V4","v":"3 Year Average"}]
[null,{"$f":"Worksheet!Q5","v":"Business Revenue"},{"$f":"Worksheet!R5","v":500000},{"$f":"Worksheet!S5","v":542084.94208494201},{"$f":"Worksheet!T5","v":563768.33976833976},{"$f":"Worksheet!U5","v":591494.65156022529},{"$f":"Worksheet!V5","v":565782.6444711691}]
[null,{"$f":"Worksheet!Q6","v":"Expenses"}]
[null,{"$f":"Worksheet!Q7","v":"Variable Costs"}]
[null,{"$f":"Worksheet!Q8","v":"Materials & Supplies"},{"$f":"Worksheet!R8","v":10000},{"$f":"Worksheet!S8","v":11116.97635135135},{"$f":"Worksheet!T8","v":11672.82516891892},{"$f":"Worksheet!U8","v":12246.898537882147},{"$f":"Worksheet!V8","v":11678.90001938414}]
[null,{"$f":"Worksheet!Q9","v":"% Revenue"},{"$f":"Worksheet!R9","v":0.02},{"$f":"Worksheet!S9","v":2.05078125E-2},{"$f":"Worksheet!T9","v":2.0705003004807696E-2},{"$f":"Worksheet!U9","v":2.0705003004807699E-2},{"$f":"Worksheet!V9","v":2.0642025932591627E-2}]
{"$rows_left_out":42}
{"sheet":"Budget by Month Master","index":11,"n_rows":59,"n_cols":17,"rows_kept":59,"cut":false,"hidden":false,"merged":[[69,1,69,16],[66,1,66,16],[67,1,67,16],[68,1,68,16],[64,1,64,16],[65,1,65,16],[63,1,63,16],[62,1,62,16],[1,1,1,16],[60,1,60,16],[4,3,4,15],[4,2,5,2],[61,1,61,16]]}
[]
[null,"Budget by Month Master"]
[null,"Budget by Month Master",null,{"$f":"+D$7/$P$7*D$9/(1/12)","v":1.0000000000000002E-2},{"$f":"+E$7/$P$7*E$9/(1/12)","v":2.769230769230769E-2},4.8461538461538466E-2,4.492307692307692E-2,7.0769230769230765E-2,7.6615384615384627E-2,9.6923076923076931E-2,0.10953846153846153,0.11769230769230771,0.13076923076923078,0.13369230769230769,0.11815384615384647,{"$f":"SUM(D3:O3)","v":0.98523076923076958}]
[null,{"$f":"Worksheet!B3","v":"Acme Widgets"}]
[null,{"$f":"+Worksheet!B4","v":"Expected"},{"$f":"Worksheet!C4","v":"Current Year"},"Budget Year"]
[null,"Budget Month",null,"2022-07-01",{"$f":"+D6+31","v":"2022-08-01"},{"$f":"+E6+31","v":"2022-09-01"},"2022-10-02","2022-11-02","2022-12-03","2023-01-03","2023-02-03","2023-03-06","2023-04-06","2023-05-07","2023-06-07","Full Year","Variation Year/Year"]
[null,null,null,1,2,3,4,5,6,7,8,9,10,11,12,{"$f":"SUM(D7:O7)","v":78}]
[null,"Base Revenue",{"$f":"Worksheet!C5","v":500000},{"$f":"+$C8*D9","v":32500},{"$f":"+$C8*E9","v":45000},52500,36500,46000,41500,45000,44500,42500,42500,39500,32000.000000000084,{"$f":"+C8","v":500000}]
[null,"Percentage Contributor",null,6.5000000000000002E-2,0.09,0.105,7.2999999999999995E-2,9.1999999999999998E-2,8.3000000000000004E-2,0.09,8.8999999999999996E-2,8.5000000000000006E-2,8.5000000000000006E-2,7.9000000000000001E-2,{"$f":"+P9-SUM(D9:N9)","v":6.4000000000000168E-2},1]
[null,"Growth Revenue",null,{"$f":"+D11*$P$10","v":615.89237309205998},{"$f":"+E11*$P$10","v":1705.5481101010889},2984.7091926769058,2766.7780452750994,4358.6229480361153,4718.6831046130128,5969.4183853538116,6746.3903021776396,7248.5794679296287,8053.9771865884768,8234.0072648769237,7277.0052697646661,{"$f":"+P12-P8","v":60679.611650485429}]
{"$rows_left_out":50}
{"sheet":"Budget by Month","index":13,"n_rows":59,"n_cols":18,"rows_kept":59,"cut":false,"hidden":false,"merged":[[4,1,5,1],[2,1,3,1],[63,2,63,17],[64,2,64,17],[62,2,62,17],[1,2,1,17],[4,2,5,2],[4,17,5,17],[69,2,69,17],[66,2,66,17],[67,2,67,17],[68,2,68,17],[4,4,4,16],[4,3,5,3],[61,2,61,17],[65,2,65,17],[60,2,60,17]]}
[]
[null,null,"Budget by Month"]
[null,null,"Budget by Month",null,null,null,null,null,null,null,{"$f":"'Budget by Month Master'!J3","v":9.6923076923076931E-2}]
[null,null,{"$f":"'Budget by Month Master'!B4","v":"Acme Widgets"}]
[null,null,"Expected","Current Year","Budget Year",null,null,null,null,null,null,null,null,null,null,null,null,{"$f":"'Budget by Month Master'!Q6","v":"Variation Year/Year"}]
[null,null,null,null,"2010-01-01",{"$f":"+E6+31","v":"2010-02-01"},{"$f":"+F6+31","v":"2010-03-04"},"2010-04-04","2010-05-05","2010-06-05","2010-07-06","2010-08-06","2010-09-06","2010-10-07","2010-11-07","2010-12-08",{"$f":"'Budget by Month Master'!P6","v":"Full Year"}]
[]
[null,null,"Base Revenue",500000,32500,45000,52500,36500,46000,41500,45000,44500,42500,42500,39500,32000.000000000084,{"$f":"SUM(E8:P8)","v":500000.00000000006}]
[null,null,null,null,{"$f":"+E8/$Q8","v":6.4999999999999988E-2},{"$f":"+F8/$Q8","v":8.9999999999999983E-2},0.10499999999999998,7.2999999999999995E-2,9.1999999999999985E-2,8.299999999999999E-2,8.9999999999999983E-2,8.8999999999999996E-2,8.4999999999999992E-2,8.4999999999999992E-2,7.8999999999999987E-2,6.4000000000000154E-2,1]
[null,null,"Growth Revenue",null,615.89237309205998,1705.5481101010889,2984.7091926769058,2766.7780452750994,4358.6229480361153,4718.6831046130128,5969.4183853538116,6746.3903021776396,7248.5794679296287,8053.9771865884768,8234.0072648769237,7277.0052697646661,{"$f":"SUM(E10:P10)","v":60679.611650485436}]
{"$rows_left_out":50}
{"sheet":"Instructions","index":15,"n_rows":67,"n_cols":4,"rows_kept":67,"cut":false,"hidden":false,"merged":[[1,1,1,3],[67,1,67,3],[5,1,5,3],[2,1,2,3],[6,1,6,3],[73,1,73,3],[74,1,74,3],[75,1,75,3],[76,1,76,3],[68,1,68,3],[70,1,70,3],[71,1,71,3],[72,1,72,3],[69,1,69,3]]}
[]
[null,"Instructions"]
[null,"Overview"]
[null,"Outline",null,"Forecast Budget is a streamlined tool for developing a 3 year business forecast and a 12 month budget. It requires minimal inputs and generates Optimistic to Pessimistic forecasts for your business. From your forecasts a 12 month master budget is built. You then have the capacity to refine this budget as required. The methodology used applies relationships between current data and relative indicators for future performance to produce a verifiable budget quickly and easily. This forecast and budget tool can be utilized for existing and proposed businesses, products, or services. Outputs include a 3 Year Forecast with Sensitivity Analysis, and a Budget by Month in tabular and graphical form."]
[]
[null,"Input"]
[null,"All inputs are in Blue cells on the Input, Analysis, and Budget Sheets. Click the tab, hyperlinks or buttons to access."]
[null,{"$f":"+Input!B9","v":"Current Operating Performance Data"},null,"This section reviews the current performance of your business for a full year period. It is designed to assess the level of expenses that vary with your sales (Variable Costs) and those that don't (Fixed Costs).  It also allocates a realistic labor cost for the owners effort.  The focus is on cash flow excluding assets and  taxation.  Broad expense categories are provided.  Values can be based on the previous years tax return adjusted for current trading.  Inputs do not have to be perfect but should reasonably reflect business operation. It forms the starting point for your budget. If you are building a budget for a new business or product input estimated base Revenue, Variable Cost and Fixed Cost data. To estimate your Base data annualize your expected trading for the first month (multiply it by 12). This will provide a reference point. Ensure your Variable Cost ratios are reasonable and the Fixed Costs reflect a full years trading."]
[null,{"$f":"+Input!B11","v":"Business Name or Identifier"},null,"Input a name for the business. This appears as an identifier on the Output Sheets."]
[null,{"$f":"+Input!B13","v":"Business Revenue"},null,"Input the Revenue generated by the business for the current year."]
{"$rows_left_out":58}
{"sheet":"Worksheet","index":16,"n_rows":91,"n_cols":22,"rows_kept":91,"cut":false,"hidden":true,"merged":[[51,16,51,20],[52,16,52,19],[71,16,71,18],[52,1,52,4],[51,1,51,5],[71,1,71,3],[51,9,51,13],[52,9,52,12],[71,9,71,11]]}
[]
[null,"Expected Forecast",null,null,null,null,null,null,null,"Optimistic Forecast improved by",{"$f":"+'Sensitivity Analysis'!E7","v":0.2},null,null,null,null,null,"Pessimistic Forecast degraded by",{"$f":"+'Sensitivity Analysis'!E8","v":0.2}]
[null,{"$f":"+Input!C11","v":"Acme Widgets"},null,null,null,null,null,null,null,{"$f":"+$B3","v":"Acme Widgets"},null,null,null,null,null,null,{"$f":"+$B3","v":"Acme Widgets"}]
[null,"Expected",{"$f":"+C54","v":"Current Year"},{"$f":"+D54","v":"Year 1"},{"$f":"+E54","v":"Year 2"},{"$f":"+F54","v":"Year 3"},{"$f":"+G81","v":"3 Year Average"},null,null,"Optimistic",{"$f":"+K54","v":"Current Year"},{"$f":"+L54","v":"Year 1"},{"$f":"+M54","v":"Year 2"},{"$f":"+N54","v":"Year 3"},{"$f":"+O81","v":"3 Year Average"},null,"Pessimistic",{"$f":"+R54","v":"Current Year"},{"$f":"+S54","v":"Year 1"},{"$f":"+T54","v":"Year 2"},{"$f":"+U54","v":"Year 3"},{"$f":"+V81","v":"3 Year Average"}]
[null,{"$f":"+Input!B13","v":"Business Revenue"},{"$f":"+Input!C13","v":500000},{"$f":"+C5*D56*D60/D55","v":560679.61165048543},{"$f":"+D5*E56*E60/E55","v":588713.59223300975},{"$f":"+E5*F56*F60/F55","v":625128.8659793816},{"$f":"AVERAGE(D5:F5)","v":591507.35662095889},null,null,{"$f":"+$B5","v":"Business Revenue"},{"$f":"+C5","v":500000},{"$f":"+K5*L56*L60/L55","v":579687.5},{"$f":"+L5*M56*M60/M55","v":614468.75},{"$f":"+M5*N56*N60/N55","v":660362.68153526972},{"$f":"AVERAGE(L5:N5)","v":618172.9771784232},null,{"$f":"+$B5","v":"Business Revenue"},{"$f":"+C5","v":500000},{"$f":"+R5*S56*S60/S55","v":542084.94208494201},{"$f":"+S5*T56*T60/T55","v":563768.33976833976},{"$f":"+T5*U56*U60/U55","v":591494.65156022529},{"$f":"AVERAGE(S5:U5)","v":565782.6444711691}]
[null,{"$f":"+Input!B15","v":"Expenses"},null,null,null,null,null,null,null,{"$f":"+$B6","v":"Expenses"},null,null,null,null,null,null,{"$f":"+$B6","v":"Expenses"}]
[null,{"$f":"+Input!B16","v":"Variable Costs"},null,null,null,null,null,null,null,"Variable Costs",null,null,null,null,null,null,"Variable Costs"]
[null,{"$f":"+Input!B17","v":"Materials & Supplies"},{"$f":"IF(Input!C$15=Input!B$81,Input!C$17,Input!D$17)","v":10000},{"$f":"+D5*$C9*$D57/D61","v":11431.331888019608},{"$f":"+E5*$C9*$D57*$E57/D61/E61","v":12002.898482420587},{"$f":"+F5*$C9*$D57*$E57*F57/D61/E61/F61","v":12745.345811230112},{"$f":"AVERAGE(D8:F8)","v":12059.858727223434},null,null,"Materials & Supplies",{"$f":"+C8","v":10000},{"$f":"+L5*$C9*$D57/L61","v":11750.422297297297},{"$f":"+M5*$C9*$D57*$E57/L61/M61","v":12337.943412162162},{"$f":"+N5*$C9*$D57*$E57*N57/L61/M61/N61","v":13259.449559128632},{"$f":"AVERAGE(L8:N8)","v":12449.271756196031},null,"Materials & Supplies",{"$f":"+C8","v":10000},{"$f":"+S5*$C9*$D57/S61","v":11116.97635135135},{"$f":"+T5*$C9*$D57*$E57/S61/T61","v":11672.82516891892},{"$f":"+U5*$C9*$D57*$E57*U57/S61/T61/U61","v":12246.898537882147},{"$f":"AVERAGE(S8:U8)","v":11678.90001938414}]
[null,"% Revenue",{"$f":"+C8/C$5","v":0.02},{"$f":"+D8/D5","v":2.0388349514563111E-2},{"$f":"+E8/E5","v":2.0388349514563107E-2},{"$f":"+F8/F5","v":2.0388349514563111E-2},{"$f":"+G8/G5","v":2.0388349514563107E-2},null,null,"% Revenue",{"$f":"+K8/K$5","v":0.02},{"$f":"+L8/L5","v":2.0270270270270268E-2},{"$f":"+M8/M5","v":2.0079041305456399E-2},{"$f":"+N8/N5","v":2.0079041305456402E-2},{"$f":"+O8/O5","v":2.013881585866022E-2},null,"% Revenue",{"$f":"+R8/R$5","v":0.02},{"$f":"+S8/S5","v":2.05078125E-2},{"$f":"+T8/T5","v":2.0705003004807696E-2},{"$f":"+U8/U5","v":2.0705003004807699E-2},{"$f":"+V8/V5","v":2.0642025932591627E-2}]
[null,{"$f":"+Input!B18","v":"Labor excluding Owner"},{"$f":"IF(Input!C$15=Input!B$81,Input!C$18,Input!D$18)","v":200000},{"$f":"+D$5*($C11+$C13)*D58/D61-D12","v":222477.96682062396},{"$f":"+E$5*($C11+$C13)*D58*E58/D61/E61-E12","v":229085.76170759567},{"$f":"+F$5*($C11+$C13)*D58*E58*F58/D61/E61/F61-F12","v":258404.25030321415},{"$f":"AVERAGE(D10:F10)","v":236655.99294381126},null,null,"Labor excluding Owner",{"$f":"+C10","v":200000},{"$f":"+L$5*($C11+$C13)*L58/L61-L12","v":230170.39695945947},{"$f":"+M$5*($C11+$C13)*L58*M58/L61/M61-M12","v":235320.77756314661},{"$f":"+N$5*($C11+$C13)*L58*M58*N58/L61/M61/N61-N12","v":265969.27342111943},{"$f":"AVERAGE(L10:N10)","v":243820.14931457516},null,"Labor excluding Owner",{"$f":"+C10","v":200000},{"$f":"+S$5*($C11+$C13)*S58/S61-S12","v":214900.33783783778},{"$f":"+T$5*($C11+$C13)*S58*T58/S61/T61-T12","v":222879.78046240841},{"$f":"+U$5*($C11+$C13)*S58*T58*U58/S61/T61/U61-U12","v":250882.66180386988},{"$f":"AVERAGE(S10:U10)","v":229554.26003470537}]
{"$rows_left_out":82}
{"sheet":"Scratch","index":17,"n_rows":107,"n_cols":10,"rows_kept":107,"cut":false,"hidden":true,"merged":[]}
[]
[]
[]
[]
[]
[]
[]
[]
[]
[]
{"$rows_left_out":97}